Reaction Details
TargetCarbonic anhydrase 12
LigandBDBM50209861
Substrate/Competitorn/a
Meas. Tech.ChEMBL_1634233 (CHEMBL3877025)
Ki 79±n/a nM
Citation Kumar, RBua, SRam, SDel Prete, SCapasso, CSupuran, CTSharma, PK Benzenesulfonamide bearing imidazothiadiazole and thiazolotriazole scaffolds as potent tumor associated human carbonic anhydrase IX and XII inhibitors. Bioorg Med Chem25:1286-1293 (2017) 
 
Carbonic anhydrase 12
Name:Carbonic anhydrase 12
Type:Enzyme
Mol. Mass.:39456.00
Organism:Homo sapiens (Human)
Description:Catalytic domain of human cloned isozyme was used in the assay
Residue:354
BDBM50209861
NameBDBM50209861
Synonyms:CHEMBL3884557
TypeSmall organic molecule
Emp. Form.C16H11FN4O2S2
Mol. Mass.374.413
SMILESNS(=O)(=O)c1ccc(cc1)-c1nn2cc(nc2s1)-c1ccc(F)cc1