Reaction Details
TargetCarbonic anhydrase 12
LigandBDBM50209865
Substrate/Competitorn/a
Meas. Tech.ChEMBL_1634233 (CHEMBL3877025)
Ki 302±n/a nM
Citation Kumar, RBua, SRam, SDel Prete, SCapasso, CSupuran, CTSharma, PK Benzenesulfonamide bearing imidazothiadiazole and thiazolotriazole scaffolds as potent tumor associated human carbonic anhydrase IX and XII inhibitors. Bioorg Med Chem25:1286-1293 (2017) 
 
Carbonic anhydrase 12
Name:Carbonic anhydrase 12
Type:Enzyme
Mol. Mass.:39456.00
Organism:Homo sapiens (Human)
Description:Catalytic domain of human cloned isozyme was used in the assay
Residue:354
BDBM50209865
NameBDBM50209865
Synonyms:CHEMBL3885122
TypeSmall organic molecule
Emp. Form.C16H11BrN4O2S2
Mol. Mass.435.318
SMILESNS(=O)(=O)c1ccc(cc1)-c1nc2scc(-c3ccc(Br)cc3)n2n1