Reaction Details
TargetCarbonic anhydrase 1
LigandBDBM50210047
Substrate/Competitorn/a
Meas. Tech.ChEMBL_1634230 (CHEMBL3877022)
Ki 318±n/a nM
Citation Kumar, RBua, SRam, SDel Prete, SCapasso, CSupuran, CTSharma, PK Benzenesulfonamide bearing imidazothiadiazole and thiazolotriazole scaffolds as potent tumor associated human carbonic anhydrase IX and XII inhibitors. Bioorg Med Chem25:1286-1293 (2017) 
 
Carbonic anhydrase 1
Name:Carbonic anhydrase 1
Type:Enzyme
Mol. Mass.:28873.37
Organism:Homo sapiens (Human)
Description:P00915
Residue:261
BDBM50210047
NameBDBM50210047
Synonyms:CHEMBL3885288
TypeSmall organic molecule
Emp. Form.C16H12N4O2S2
Mol. Mass.356.422
SMILESNS(=O)(=O)c1ccc(cc1)-c1nn2cc(nc2s1)-c1ccccc1