Reaction Details
TargetCarbonic anhydrase 2
LigandBDBM50209890
Substrate/Competitorn/a
Meas. Tech.ChEMBL_1634231 (CHEMBL3877023)
Ki 3865±n/a nM
Citation Kumar, RBua, SRam, SDel Prete, SCapasso, CSupuran, CTSharma, PK Benzenesulfonamide bearing imidazothiadiazole and thiazolotriazole scaffolds as potent tumor associated human carbonic anhydrase IX and XII inhibitors. Bioorg Med Chem25:1286-1293 (2017) 
 
Carbonic anhydrase 2
Name:Carbonic anhydrase 2
Type:Enzyme
Mol. Mass.:29250.71
Organism:Homo sapiens (Human)
Description:P00918
Residue:260
BDBM50209890
NameBDBM50209890
Synonyms:CHEMBL3884122
TypeSmall organic molecule
Emp. Form.C16H11N5O4S2
Mol. Mass.401.42
SMILESNS(=O)(=O)c1ccc(cc1)-c1nc2scc(-c3ccc(cc3)[N+]([O-])=O)n2n1