Reaction Details
TargetCarbonic anhydrase 12
LigandBDBM50209889
Substrate/Competitorn/a
Meas. Tech.ChEMBL_1634233 (CHEMBL3877025)
Ki 3.8±n/a nM
Citation Kumar, RBua, SRam, SDel Prete, SCapasso, CSupuran, CTSharma, PK Benzenesulfonamide bearing imidazothiadiazole and thiazolotriazole scaffolds as potent tumor associated human carbonic anhydrase IX and XII inhibitors. Bioorg Med Chem25:1286-1293 (2017) 
 
Carbonic anhydrase 12
Name:Carbonic anhydrase 12
Type:Enzyme
Mol. Mass.:39456.00
Organism:Homo sapiens (Human)
Description:Catalytic domain of human cloned isozyme was used in the assay
Residue:354
BDBM50209889
NameBDBM50209889
Synonyms:CHEMBL3884342
TypeSmall organic molecule
Emp. Form.C17H14N4O3S2
Mol. Mass.386.448
SMILESCOc1ccc(cc1)-c1cn2nc(sc2n1)-c1ccc(cc1)S(N)(=O)=O