Reaction Details
TargetCarbonic anhydrase 12
LigandBDBM50209864
Substrate/Competitorn/a
Meas. Tech.ChEMBL_1634233 (CHEMBL3877025)
Ki 62±n/a nM
Citation Kumar, RBua, SRam, SDel Prete, SCapasso, CSupuran, CTSharma, PK Benzenesulfonamide bearing imidazothiadiazole and thiazolotriazole scaffolds as potent tumor associated human carbonic anhydrase IX and XII inhibitors. Bioorg Med Chem25:1286-1293 (2017) 
 
Carbonic anhydrase 12
Name:Carbonic anhydrase 12
Type:Enzyme
Mol. Mass.:39456.00
Organism:Homo sapiens (Human)
Description:Catalytic domain of human cloned isozyme was used in the assay
Residue:354
BDBM50209864
NameBDBM50209864
Synonyms:CHEMBL3884878
TypeSmall organic molecule
Emp. Form.C22H16N4O2S2
Mol. Mass.432.518
SMILESNS(=O)(=O)c1ccc(cc1)-c1nn2cc(nc2s1)-c1ccc(cc1)-c1ccccc1