Reaction Details
TargetLysine-specific histone demethylase 1A
LigandBDBM50210048
Substrate/Competitorn/a
Meas. Tech.ChEMBL_1634250 (CHEMBL3877042)
Ki 44000±n/a nM
Citation Amano, YUmezawa, NSato, SWatanabe, HUmehara, THiguchi, T Activation of lysine-specific demethylase 1 inhibitor peptide by redox-controlled cleavage of a traceless linker. Bioorg Med Chem25:1227-1234 (2017) 
 
Lysine-specific histone demethylase 1A
Name:Lysine-specific histone demethylase 1A
Type:Enzyme
Mol. Mass.:92901.01
Organism:Homo sapiens (Human)
Description:O60341
Residue:852
BDBM50210048
NameBDBM50210048
Synonyms:CHEMBL3884919
TypeSmall organic molecule
Emp. Form.C57H93N17O14S2
Mol. Mass.1304.584
SMILESCC(C)C[C@@H]1NC(=O)[C@H](Cc2ccccc2)NC(=O)[C@H](CO)NC(=O)[C@H](CCCNC(N)=N)NC(=O)[C@@H]2CCCN2C(=O)OCCSSCCOC(=O)NCCCC[C@H](NC(=O)[C@H](CCCNC(N)=N)NC(=O)[C@@H](NC1=O)C(C)C)C(=O)N1CCC[C@H]1C(N)=O