Reaction Details
TargetREST corepressor 1 [4-485]
LigandBDBM50158884
Substrate/Competitorn/a
Meas. Tech.ChEMBL_1634253 (CHEMBL3877045)
Ki 140±n/a nM
Citation Amano, YUmezawa, NSato, SWatanabe, HUmehara, THiguchi, T Activation of lysine-specific demethylase 1 inhibitor peptide by redox-controlled cleavage of a traceless linker. Bioorg Med Chem25:1227-1234 (2017) 
 
REST corepressor 1 [4-485]
Name:REST corepressor 1 [4-485]
Type:PROTEIN
Mol. Mass.:53029.95
Organism:Homo sapiens (Human)
Description:ChEMBL_108118
Residue:482
BDBM50158884
NameBDBM50158884
Synonyms:CHEMBL3785550
TypeSmall organic molecule
Emp. Form.C51H87N17O10
Mol. Mass.1098.3444
SMILESCC(C)C[C@H](NC(=O)[C@H](Cc1ccccc1)NC(=O)[C@H](CO)NC(=O)[C@H](CCCNC(N)=N)NC(=O)[C@@H]1CCCN1)C(=O)N[C@@H](C(C)C)C(=O)N[C@@H](CCCNC(N)=N)C(=O)N[C@@H](CCCCN)C(=O)N1CCC[C@H]1C(N)=O