Reaction Details
TargetMitogen-activated protein kinase 14
LigandBDBM50045333
Substrate/Competitorn/a
Meas. Tech.ChEMBL_1634405 (CHEMBL3877197)
IC50 25±n/a nM
Citation Munoz, L Non-kinase targets of protein kinase inhibitors. Nat Rev Drug Discov16:424-440 (2017) 
 
Mitogen-activated protein kinase 14
Name:Mitogen-activated protein kinase 14
Type:Serine/threonine-protein kinase
Mol. Mass.:41286.76
Organism:Homo sapiens (Human)
Description:Q16539
Residue:360
BDBM50045333
NameBDBM50045333
Synonyms:CHEBI:90705 | SB-203580
TypeSmall organic molecule
Emp. Form.C21H16FN3OS
Mol. Mass.377.435
SMILESC[S+]([O-])c1ccc(cc1)-c1nc(c([nH]1)-c1ccncc1)-c1ccc(F)cc1