Reaction Details
TargetMitogen-activated protein kinase 14
LigandBDBM50044784
Substrate/Competitorn/a
Meas. Tech.ChEMBL_1634405 (CHEMBL3877197)
IC50 28±n/a nM
Citation Munoz, L Non-kinase targets of protein kinase inhibitors. Nat Rev Drug Discov16:424-440 (2017) 
 
Mitogen-activated protein kinase 14
Name:Mitogen-activated protein kinase 14
Type:Serine/threonine-protein kinase
Mol. Mass.:41286.76
Organism:Homo sapiens (Human)
Description:Q16539
Residue:360
BDBM50044784
NameBDBM50044784
Synonyms:CHEBI:79090 US10865384, Compound SB202190
TypeSmall organic molecule
Emp. Form.C20H14FN3O
Mol. Mass.331.3431
SMILESOc1ccc(cc1)-c1nc(c([nH]1)-c1ccncc1)-c1ccc(F)cc1