Reaction Details
TargetTyrosine-protein kinase JAK2
LigandBDBM50332294
Substrate/Competitorn/a
Meas. Tech.ChEMBL_1634397 (CHEMBL3877189)
IC50 3.0±n/a nM
Citation Munoz, L Non-kinase targets of protein kinase inhibitors. Nat Rev Drug Discov16:424-440 (2017) 
 
Tyrosine-protein kinase JAK2
Name:Tyrosine-protein kinase JAK2
Type:Protein
Mol. Mass.:130684.68
Organism:Homo sapiens (Human)
Description:O60674
Residue:1132
BDBM50332294
NameBDBM50332294
Synonyms:CHEMBL1287853 US10112907, Example 00018 US10766894, Compound TABLE 1.3 US11384069, Example T-5
TypeSmall organic molecule
Emp. Form.C27H36N6O3S
Mol. Mass.524.678
SMILESCc1cnc(Nc2ccc(OCCN3CCCC3)cc2)nc1Nc1cccc(c1)S(=O)(=O)NC(C)(C)C