Reaction Details
TargetBromodomain-containing protein 2
LigandBDBM50210161
Substrate/Competitorn/a
Meas. Tech.ChEMBL_1634410 (CHEMBL3877202)
IC50 7400±n/a nM
Citation Munoz, L Non-kinase targets of protein kinase inhibitors. Nat Rev Drug Discov16:424-440 (2017) 
 
Bromodomain-containing protein 2
Name:Bromodomain-containing protein 2
Type:Protein
Mol. Mass.:88085.95
Organism:Homo sapiens (Human)
Description:P25440
Residue:801
BDBM50210161
NameBDBM50210161
Synonyms:CHEMBL1363184 | LY-303511
TypeSmall organic molecule
Emp. Form.C19H18N2O2
Mol. Mass.306.3584
SMILESO=c1cc(oc2c(cccc12)-c1ccccc1)N1CCNCC1