Reaction Details
TargetCyclin-dependent kinase 2
LigandBDBM50139171
Substrate/Competitorn/a
Meas. Tech.ChEMBL_1634392 (CHEMBL3877184)
IC50 1.000000±n/a nM
Citation Munoz, L Non-kinase targets of protein kinase inhibitors. Nat Rev Drug Discov16:424-440 (2017) 
 
Cyclin-dependent kinase 2
Name:Cyclin-dependent kinase 2
Type:Enzyme Subunit
Mol. Mass.:33938.17
Organism:Homo sapiens (Human)
Description:P24941
Residue:298
BDBM50139171
NameBDBM50139171
Synonyms:Dinaciclib SCH-727965 US20230416221, Compound Dinaciclib
TypeSmall organic molecule
Emp. Form.C21H28N6O2
Mol. Mass.396.486
SMILESCCc1cnn2c(NCc3ccc[n+]([O-])c3)cc(nc12)N1CCCC[C@H]1CCO