Reaction Details
TargetCasein kinase I isoform delta
LigandBDBM50364141
Substrate/Competitorn/a
Meas. Tech.ChEMBL_1634428 (CHEMBL3877220)
IC50 32±n/a nM
Citation Munoz, L Non-kinase targets of protein kinase inhibitors. Nat Rev Drug Discov16:424-440 (2017) 
 
Casein kinase I isoform delta
Name:Casein kinase I isoform delta
Type:Enzyme
Mol. Mass.:47356.76
Organism:Homo sapiens (Human)
Description:P48730
Residue:415
BDBM50364141
NameBDBM50364141
Synonyms:CHEMBL1951415
TypeSmall organic molecule
Emp. Form.C19H20FN5
Mol. Mass.337.394
SMILESNc1nccc(n1)-c1c(ncn1C1CCCCC1)-c1ccc(F)cc1