Reaction Details
TargetPhosphatidylinositol 4,5-bisphosphate 3-kinase catalytic subunit alpha isoform
LigandBDBM12915
Substrate/Competitorn/a
Meas. Tech.ChEMBL_1634412 (CHEMBL3877204)
IC50 2370±n/a nM
Citation Munoz, L Non-kinase targets of protein kinase inhibitors. Nat Rev Drug Discov16:424-440 (2017) 
 
Phosphatidylinositol 4,5-bisphosphate 3-kinase catalytic subunit alpha isoform
Name:Phosphatidylinositol 4,5-bisphosphate 3-kinase catalytic subunit alpha isoform
Type:Enzyme Subunit
Mol. Mass.:124294.87
Organism:Homo sapiens (Human)
Description:P42336
Residue:1068
BDBM12915
NameBDBM12915
Synonyms:2-(4-Morpholinyl)-8-phenyl-4H-1-benzopyran-4-one CHEMBL98350 US10308662, Compound LY294002 | US9505780, LY294002
TypeSmall organic molecule
Emp. Form.C19H17NO3
Mol. Mass.307.3432
SMILESO=c1cc(oc2c(cccc12)-c1ccccc1)N1CCOCC1