Reaction Details
TargetBromodomain-containing protein 4
LigandBDBM192755
Substrate/Competitorn/a
Meas. Tech.ChEMBL_1634389 (CHEMBL3877181)
IC50 130±n/a nM
Citation Munoz, L Non-kinase targets of protein kinase inhibitors. Nat Rev Drug Discov16:424-440 (2017) 
 
Bromodomain-containing protein 4
Name:Bromodomain-containing protein 4
Type:Protein
Mol. Mass.:152264.84
Organism:Homo sapiens (Human)
Description:O60885
Residue:1362
BDBM192755
NameBDBM192755
Synonyms:TG101209 US11643396, Example TG101209
TypeSmall organic molecule
Emp. Form.C26H35N7O2S
Mol. Mass.509.667
SMILESCN1CCN(CC1)c1ccc(Nc2ncc(C)c(Nc3cccc(c3)S(=O)(=O)NC(C)(C)C)n2)cc1