Reaction Details
TargetTyrosine-protein kinase JAK2
LigandBDBM50210253
Substrate/Competitorn/a
Meas. Tech.ChEMBL_1634447 (CHEMBL3877345)
IC50<39±n/a nM
Citation Yang, EGMustafa, NTan, ECPoulsen, ARamanujulu, PMChng, WJYen, JJDymock, BW Design and Synthesis of Janus Kinase 2 (JAK2) and Histone Deacetlyase (HDAC) Bispecific Inhibitors Based on Pacritinib and Evidence of Dual Pathway Inhibition in Hematological Cell Lines. J Med Chem59:8233-62 (2016) 
 
Tyrosine-protein kinase JAK2
Name:Tyrosine-protein kinase JAK2
Type:Protein
Mol. Mass.:130684.68
Organism:Homo sapiens (Human)
Description:O60674
Residue:1132
BDBM50210253
NameBDBM50210253
Synonyms:CHEMBL3943650
TypeSmall organic molecule
Emp. Form.C30H35N3O5
Mol. Mass.517.616
SMILESOC(=O)CCCCCCCOc1ccc2Nc3nccc(n3)-c3cccc(COC\C=C\COCc1c2)c3