Reaction Details
TargetTyrosine-protein kinase JAK2
LigandBDBM50210190
Substrate/Competitorn/a
Meas. Tech.ChEMBL_1634446 (CHEMBL3877344)
IC50 2.3±n/a nM
Citation Yang, EGMustafa, NTan, ECPoulsen, ARamanujulu, PMChng, WJYen, JJDymock, BW Design and Synthesis of Janus Kinase 2 (JAK2) and Histone Deacetlyase (HDAC) Bispecific Inhibitors Based on Pacritinib and Evidence of Dual Pathway Inhibition in Hematological Cell Lines. J Med Chem59:8233-62 (2016) 
 
Tyrosine-protein kinase JAK2
Name:Tyrosine-protein kinase JAK2
Type:Protein
Mol. Mass.:130684.68
Organism:Homo sapiens (Human)
Description:O60674
Residue:1132
BDBM50210190
NameBDBM50210190
Synonyms:CHEMBL3964125
TypeSmall organic molecule
Emp. Form.C38H43N5O6
Mol. Mass.665.7779
SMILESOC(=O)CCCCCCC(=O)Nc1ccc(NCCOc2ccc3Nc4nccc(n4)-c4cccc(COC\C=C\COCc2c3)c4)cc1