Reaction Details
TargetTyrosine-protein kinase JAK2
LigandBDBM50210260
Substrate/Competitorn/a
Meas. Tech.ChEMBL_1634447 (CHEMBL3877345)
IC50<39±n/a nM
Citation Yang, EGMustafa, NTan, ECPoulsen, ARamanujulu, PMChng, WJYen, JJDymock, BW Design and Synthesis of Janus Kinase 2 (JAK2) and Histone Deacetlyase (HDAC) Bispecific Inhibitors Based on Pacritinib and Evidence of Dual Pathway Inhibition in Hematological Cell Lines. J Med Chem59:8233-62 (2016) 
 
Tyrosine-protein kinase JAK2
Name:Tyrosine-protein kinase JAK2
Type:Protein
Mol. Mass.:130684.68
Organism:Homo sapiens (Human)
Description:O60674
Residue:1132
BDBM50210260
NameBDBM50210260
Synonyms:CHEMBL3982857
TypeSmall organic molecule
Emp. Form.C31H30N4O5
Mol. Mass.538.5937
SMILESOC(=O)c1cccc(NCCOc2ccc3Nc4nccc(n4)-c4cccc(COC\C=C\COCc2c3)c4)c1