Reaction Details
TargetHistone deacetylase 6
LigandBDBM50210254
Substrate/Competitorn/a
Meas. Tech.ChEMBL_1634443 (CHEMBL3877341)
IC50 107±n/a nM
Citation Yang, EGMustafa, NTan, ECPoulsen, ARamanujulu, PMChng, WJYen, JJDymock, BW Design and Synthesis of Janus Kinase 2 (JAK2) and Histone Deacetlyase (HDAC) Bispecific Inhibitors Based on Pacritinib and Evidence of Dual Pathway Inhibition in Hematological Cell Lines. J Med Chem59:8233-62 (2016) 
 
Histone deacetylase 6
Name:Histone deacetylase 6
Type:Chromatin regulator; hydrolase; repressor
Mol. Mass.:131381.51
Organism:Homo sapiens (Human)
Description:Q9UBN7
Residue:1215
BDBM50210254
NameBDBM50210254
Synonyms:CHEMBL3980203
TypeSmall organic molecule
Emp. Form.C27H30N4O5
Mol. Mass.490.5509
SMILESONC(=O)CCCCOc1ccc2Nc3nccc(n3)-c3cccc(COC\C=C\COCc1c2)c3