Reaction Details
TargetHistone deacetylase 6
LigandBDBM50210167
Substrate/Competitorn/a
Meas. Tech.ChEMBL_1634443 (CHEMBL3877341)
IC50 2.1±n/a nM
Citation Yang, EGMustafa, NTan, ECPoulsen, ARamanujulu, PMChng, WJYen, JJDymock, BW Design and Synthesis of Janus Kinase 2 (JAK2) and Histone Deacetlyase (HDAC) Bispecific Inhibitors Based on Pacritinib and Evidence of Dual Pathway Inhibition in Hematological Cell Lines. J Med Chem59:8233-62 (2016) 
 
Histone deacetylase 6
Name:Histone deacetylase 6
Type:Chromatin regulator; hydrolase; repressor
Mol. Mass.:131381.51
Organism:Homo sapiens (Human)
Description:Q9UBN7
Residue:1215
BDBM50210167
NameBDBM50210167
Synonyms:CHEMBL3917405
TypeSmall organic molecule
Emp. Form.C29H34N4O5
Mol. Mass.518.6041
SMILESONC(=O)CCCCCCOc1ccc2Nc3nccc(n3)-c3cccc(COC\C=C\COCc1c2)c3