Reaction Details
TargetHistone deacetylase 6
LigandBDBM50210178
Substrate/Competitorn/a
Meas. Tech.ChEMBL_1634443 (CHEMBL3877341)
IC50 2.5±n/a nM
Citation Yang, EGMustafa, NTan, ECPoulsen, ARamanujulu, PMChng, WJYen, JJDymock, BW Design and Synthesis of Janus Kinase 2 (JAK2) and Histone Deacetlyase (HDAC) Bispecific Inhibitors Based on Pacritinib and Evidence of Dual Pathway Inhibition in Hematological Cell Lines. J Med Chem59:8233-62 (2016) 
 
Histone deacetylase 6
Name:Histone deacetylase 6
Type:Chromatin regulator; hydrolase; repressor
Mol. Mass.:131381.51
Organism:Homo sapiens (Human)
Description:Q9UBN7
Residue:1215
BDBM50210178
NameBDBM50210178
Synonyms:CHEMBL3933593
TypeSmall organic molecule
Emp. Form.C37H42N6O6
Mol. Mass.666.766
SMILESONC(=O)CCCCCC(=O)Nc1ccc(NCCOc2ccc3Nc4nccc(n4)-c4cccc(COC\C=C\COCc2c3)c4)cc1