Reaction Details
TargetPyruvate kinase
LigandBDBM50210345
Substrate/Competitorn/a
Meas. Tech.ChEBML_1634707
IC50 102±n/a nM
Citation Labrière, CGong, HFinlay, BBReiner, NEYoung, RN Further investigation of inhibitors of MRSA pyruvate kinase: Towards the conception of novel antimicrobial agents. Eur J Med Chem125:1-13 (2017) 
 
Pyruvate kinase
Name:Pyruvate kinase
Type:PROTEIN
Mol. Mass.:63128.44
Organism:Staphylococcus aureus (strain MRSA252)
Description:ChEMBL_1434805
Residue:585
BDBM50210345
NameBDBM50210345
Synonyms:CHEMBL3903225
TypeSmall organic molecule
Emp. Form.C14H9Br2N
Mol. Mass.351.036
SMILESBrc1ccc(cc1)-c1c[nH]c2cc(Br)ccc12