Reaction Details
TargetPyruvate kinase
LigandBDBM50210348
Substrate/Competitorn/a
Meas. Tech.ChEBML_1634707
IC50 3.0±n/a nM
Citation Labrière, CGong, HFinlay, BBReiner, NEYoung, RN Further investigation of inhibitors of MRSA pyruvate kinase: Towards the conception of novel antimicrobial agents. Eur J Med Chem125:1-13 (2017) 
 
Pyruvate kinase
Name:Pyruvate kinase
Type:PROTEIN
Mol. Mass.:63128.44
Organism:Staphylococcus aureus (strain MRSA252)
Description:ChEMBL_1434805
Residue:585
BDBM50210348
NameBDBM50210348
Synonyms:CHEMBL3949603
TypeSmall organic molecule
Emp. Form.C16H10Br2N4O
Mol. Mass.434.085
SMILESBrc1ccc2[nH]c(cc2c1)C(=O)Nc1nc2cc(Br)ccc2[nH]1