Reaction Details
TargetPyruvate kinase
LigandBDBM50210441
Substrate/Competitorn/a
Meas. Tech.ChEMBL_1634707 (CHEMBL3877605)
IC50 10±n/a nM
Citation Labrière, CGong, HFinlay, BBReiner, NEYoung, RN Further investigation of inhibitors of MRSA pyruvate kinase: Towards the conception of novel antimicrobial agents. Eur J Med Chem125:1-13 (2017) 
 
Pyruvate kinase
Name:Pyruvate kinase
Type:PROTEIN
Mol. Mass.:63128.44
Organism:Staphylococcus aureus (strain MRSA252)
Description:ChEMBL_1434805
Residue:585
BDBM50210441
NameBDBM50210441
Synonyms:CHEMBL3939774
TypeSmall organic molecule
Emp. Form.C15H10Br2N2O
Mol. Mass.394.061
SMILESBrc1ccc(NC(=O)c2cc3ccc(Br)cc3[nH]2)cc1