Reaction Details
TargetCytochrome P450 1B1
LigandBDBM50014323
Substrate/Competitorn/a
Meas. Tech.ChEMBL_1634976 (CHEMBL3877874)
IC50 300±n/a nM
Citation Poirier, DRoy, JCortés-Benítez, FDutour, R Targeting cytochrome P450 (CYP) 1B1 with steroid derivatives. Bioorg Med Chem Lett26:5272-5276 (2016) 
 
Cytochrome P450 1B1
Name:Cytochrome P450 1B1
Type:PROTEIN
Mol. Mass.:60861.81
Organism:Homo sapiens (Human)
Description:ChEMBL_1474523
Residue:543
BDBM50014323
NameBDBM50014323
Synonyms:2-PHENYL-4H-BENZO[H]CHROMEN-4-ONE 7,8-Benzoflavone alpha-naphthoflavone
TypeSmall organic molecule
Emp. Form.C19H12O2
Mol. Mass.272.2974
SMILESO=c1cc(oc2c3ccccc3ccc12)-c1ccccc1