Reaction Details
TargetEpidermal growth factor receptor
LigandBDBM50210694
Substrate/Competitorn/a
Meas. Tech.ChEMBL_1634977 (CHEMBL3877875)
IC50 611±n/a nM
Citation Zhang, HQGong, FHYe, JQZhang, CYue, XHLi, CGXu, YGSun, LP Design and discovery of 4-anilinoquinazoline-urea derivatives as dual TK inhibitors of EGFR and VEGFR-2. Eur J Med Chem125:245-254 (2017) 
 
Epidermal growth factor receptor
Name:Epidermal growth factor receptor
Type:Receptor Kinase Domain
Mol. Mass.:134279.59
Organism:Homo sapiens (Human)
Description:P00533
Residue:1210
BDBM50210694
NameBDBM50210694
Synonyms:CHEMBL3975598
TypeSmall organic molecule
Emp. Form.C27H34N6O5
Mol. Mass.522.5961
SMILESCOC(=O)CNC(=O)c1ccc(Nc2ncnc3cc(OCCCN4CCN(C)CC4)c(OC)cc23)cc1