Reaction Details
TargetEpidermal growth factor receptor
LigandBDBM50210704
Substrate/Competitorn/a
Meas. Tech.ChEMBL_1634977 (CHEMBL3877875)
IC50 212±n/a nM
Citation Zhang, HQGong, FHYe, JQZhang, CYue, XHLi, CGXu, YGSun, LP Design and discovery of 4-anilinoquinazoline-urea derivatives as dual TK inhibitors of EGFR and VEGFR-2. Eur J Med Chem125:245-254 (2017) 
 
Epidermal growth factor receptor
Name:Epidermal growth factor receptor
Type:Receptor Kinase Domain
Mol. Mass.:134279.59
Organism:Homo sapiens (Human)
Description:P00533
Residue:1210
BDBM50210704
NameBDBM50210704
Synonyms:CHEMBL3948354
TypeSmall organic molecule
Emp. Form.C29H31ClN6O3
Mol. Mass.547.048
SMILESCOc1cc2c(Nc3ccc(NC(=O)Nc4ccccc4)c(Cl)c3)ncnc2cc1OCCN1CCCCC1