Reaction Details
TargetEpidermal growth factor receptor
LigandBDBM50210747
Substrate/Competitorn/a
Meas. Tech.ChEMBL_1634977 (CHEMBL3877875)
IC50 1.000000±n/a nM
Citation Zhang, HQGong, FHYe, JQZhang, CYue, XHLi, CGXu, YGSun, LP Design and discovery of 4-anilinoquinazoline-urea derivatives as dual TK inhibitors of EGFR and VEGFR-2. Eur J Med Chem125:245-254 (2017) 
 
Epidermal growth factor receptor
Name:Epidermal growth factor receptor
Type:Receptor Kinase Domain
Mol. Mass.:134279.59
Organism:Homo sapiens (Human)
Description:P00533
Residue:1210
BDBM50210747
NameBDBM50210747
Synonyms:CHEMBL3968039
TypeSmall organic molecule
Emp. Form.C32H38ClN7O3
Mol. Mass.604.142
SMILESCOc1cc2c(Nc3ccc(NC(=O)Nc4ccc(C)c(C)c4)c(Cl)c3)ncnc2cc1OCCCN1CCN(C)CC1