Reaction Details
TargetD(2) dopamine receptor
LigandBDBM50210754
Substrate/Competitorn/a
Meas. Tech.ChEMBL_1634986 (CHEMBL3877884)
Ki 18±n/a nM
Citation Madapa, SGadhiya, SKurtzman, TAlberts, ILRamsey, SReith, MHarding, WW Synthesis and evaluation of C9 alkoxy analogues of (-)-stepholidine as dopamine receptor ligands. Eur J Med Chem125:255-268 (2017) 
 
D(2) dopamine receptor
Name:D(2) dopamine receptor
Type:Cell-surface receptors
Mol. Mass.:50647.10
Organism:Homo sapiens (Human)
Description:P14416
Residue:443
BDBM50210754
NameBDBM50210754
Synonyms:CHEMBL3982215
TypeSmall organic molecule
Emp. Form.C21H25NO5
Mol. Mass.371.4269
SMILES[H][C@@]12Cc3ccc(O)c(OCCOC)c3CN1CCc1cc(OC)c(O)cc21