Reaction Details
TargetD(1A) dopamine receptor
LigandBDBM50378584
Substrate/Competitorn/a
Meas. Tech.ChEMBL_1634985 (CHEMBL3877883)
Ki 5.9±n/a nM
Citation Madapa, SGadhiya, SKurtzman, TAlberts, ILRamsey, SReith, MHarding, WW Synthesis and evaluation of C9 alkoxy analogues of (-)-stepholidine as dopamine receptor ligands. Eur J Med Chem125:255-268 (2017) 
 
D(1A) dopamine receptor
Name:D(1A) dopamine receptor
Type:Enzyme
Mol. Mass.:49303.43
Organism:Homo sapiens (Human)
Description:P21728
Residue:446
BDBM50378584
NameBDBM50378584
Synonyms:STEPHOLIDINE
TypeSmall organic molecule
Emp. Form.C19H21NO4
Mol. Mass.327.3743
SMILESCOc1cc2CCN3Cc4c(C[C@H]3c2cc1O)ccc(O)c4OC