Reaction Details
Target5-hydroxytryptamine receptor 1A
LigandBDBM50026917
Substrate/Competitorn/a
Meas. Tech.ChEMBL_1635131 (CHEMBL3878029)
Ki 1.3±n/a nM
Citation Franchini, SManasieva, LISorbi, CBattisti, UMFossa, PCichero, EDenora, NIacobazzi, RMCilia, APirona, LRonsisvalle, SAricò, GBrasili, L Synthesis, biological evaluation and molecular modeling of 1-oxa-4-thiaspiro- and 1,4-dithiaspiro[4.5]decane derivatives as potent and selective 5-HT Eur J Med Chem125:435-452 (2017) 
 
5-hydroxytryptamine receptor 1A
Name:5-hydroxytryptamine receptor 1A
Type:n/a
Mol. Mass.:46122.49
Organism:Homo sapiens (Human)
Description:n/a
Residue:422
BDBM50026917
NameBDBM50026917
Synonyms:8-(2-(4-(2-methoxyphenyl)piperazin-1-yl)ethyl)-8-azaspiro[4.5]decane-7,9-dione 8-{2-[4-(2-Methoxy-phenyl)-piperazin-1-yl]-ethyl}-8-aza-spiro[4.5]decane-7,9-dione BMY 7378 CHEMBL1256934 CHEMBL543741
TypeSmall organic molecule
Emp. Form.C22H31N3O3
Mol. Mass.385.4998
SMILESCOc1ccccc1N1CCN(CCN2C(=O)CC3(CCCC3)CC2=O)CC1