Reaction Details
Target5-hydroxytryptamine receptor 1A
LigandBDBM50419716
Substrate/Competitorn/a
Meas. Tech.ChEMBL_1635131 (CHEMBL3878029)
Ki 23±n/a nM
Citation Franchini, SManasieva, LISorbi, CBattisti, UMFossa, PCichero, EDenora, NIacobazzi, RMCilia, APirona, LRonsisvalle, SAricò, GBrasili, L Synthesis, biological evaluation and molecular modeling of 1-oxa-4-thiaspiro- and 1,4-dithiaspiro[4.5]decane derivatives as potent and selective 5-HT Eur J Med Chem125:435-452 (2017) 
 
5-hydroxytryptamine receptor 1A
Name:5-hydroxytryptamine receptor 1A
Type:n/a
Mol. Mass.:46122.49
Organism:Homo sapiens (Human)
Description:n/a
Residue:422
BDBM50419716
NameBDBM50419716
Synonyms:CHEMBL1946777
TypeSmall organic molecule
Emp. Form.C27H30N2O3
Mol. Mass.430.5387
SMILESCOc1ccccc1N1CCN(CC2COC(O2)(c2ccccc2)c2ccccc2)CC1