Reaction Details
TargetBeta-secretase 1
LigandBDBM50371473
Substrate/Competitorn/a
Meas. Tech.ChEMBL_1635359 (CHEMBL3878257)
IC50 99±n/a nM
Citation Panek, DWieckowska, AWichur, TBajda, MGodyn, JJonczyk, JMika, KJanockova, JSoukup, OKnez, DKorabecny, JGobec, SMalawska, B Design, synthesis and biological evaluation of new phthalimide and saccharin derivatives with alicyclic amines targeting cholinesterases, beta-secretase and amyloid beta aggregation. Eur J Med Chem125:676-695 (2017) 
 
Beta-secretase 1
Name:Beta-secretase 1
Type:Protein
Mol. Mass.:55755.10
Organism:Homo sapiens (Human)
Description:P56817
Residue:501
BDBM50371473
NameBDBM50371473
Synonyms:CHEMBL239046
TypeSmall organic molecule
Emp. Form.C36H32F2N2O4
Mol. Mass.594.6471
SMILESCCN(Cc1ccccc1)Cc1ccc(cc1)-c1cc2cc(OCCNC(=O)\C=C\c3cc(F)cc(F)c3)ccc2oc1=O