Reaction Details
TargetTranslocator protein
LigandBDBM50243007
Substrate/Competitorn/a
Meas. Tech.ChEMBL_1635026 (CHEMBL3877924)
Ki 0.910000±n/a nM
Citation Cacheux, FMédran-Navarrete, VDollé, FMarguet, FPuech, FDamont, A Synthesis and in vitro characterization of novel fluorinated derivatives of the translocator protein 18 kDa ligand CfO-DPA-714. Eur J Med Chem125:346-359 (2017) 
 
Translocator protein
Name:Translocator protein
Type:Mitochondrion membrane protein
Mol. Mass.:18945.84
Organism:Rattus norvegicus (rat)
Description:Competitive binding experiments were performed on rat kidney mitochondrial membranes.
Residue:169
BDBM50243007
NameBDBM50243007
Synonyms:2-(2-(4-(2-Fluoroethoxy)phenyl)-5,7-dimethylpyrazolo[1,5-a]pyrimidin-3-yl)-N,N-diethylacetamide N,N-diethyl-2-(2-(4-(2-fluoroethoxy)phenyl)-5,7-dimethylpyrazolo[1,5-a]pyrimidin-3-yl)acetamide
TypeSmall organic molecule
Emp. Form.C22H27FN4O2
Mol. Mass.398.4738
SMILESCCN(CC)C(=O)Cc1c(nn2c(C)cc(C)nc12)-c1ccc(OCCF)cc1