Reaction Details
Target5-hydroxytryptamine receptor 3A
LigandBDBM50211205
Substrate/Competitorn/a
Meas. Tech.ChEMBL_1636028 (CHEMBL3878926)
IC50 47000±n/a nM
Citation Cook, JZusi, FCMcDonald, IMKing, DHill, MDIwuagwu, CMate, RAFang, HZhao, RWang, BCutrone, JMa, BGao, QKnox, RJMatchett, MGallagher, LFerrante, MPost-Munson, DMolski, TEaston, AMiller, RJones, KDigavalli, SHealy, FLentz, KBenitex, YClarke, WNatale, JSiuciak, JALodge, NZaczek, RDenton, RMorgan, DBristow, LJMacor, JEOlson, RE Design and Synthesis of a New Series of 4-Heteroarylamino-1'-azaspiro[oxazole-5,3'-bicyclo[2.2.2]octanes asa7 Nicotinic Receptor Agonists. 1. Development of Pharmacophore and Early Structure-Activity Relationship. J Med Chem59:11171-11181 (2016) 
 
5-hydroxytryptamine receptor 3A
Name:5-hydroxytryptamine receptor 3A
Type:Protein
Mol. Mass.:55283.27
Organism:Homo sapiens (Human)
Description:P46098
Residue:478
BDBM50211205
NameBDBM50211205
Synonyms:CHEMBL3925945
TypeSmall organic molecule
Emp. Form.C17H20N4O2S
Mol. Mass.344.431
SMILESCOc1ccc2nc(NC3=NC4(CO3)CN3CCC4CC3)sc2c1