Reaction Details
Target5-hydroxytryptamine receptor 3A
LigandBDBM50211215
Substrate/Competitorn/a
Meas. Tech.ChEMBL_1636028 (CHEMBL3878926)
IC50 15±n/a nM
Citation Cook, JZusi, FCMcDonald, IMKing, DHill, MDIwuagwu, CMate, RAFang, HZhao, RWang, BCutrone, JMa, BGao, QKnox, RJMatchett, MGallagher, LFerrante, MPost-Munson, DMolski, TEaston, AMiller, RJones, KDigavalli, SHealy, FLentz, KBenitex, YClarke, WNatale, JSiuciak, JALodge, NZaczek, RDenton, RMorgan, DBristow, LJMacor, JEOlson, RE Design and Synthesis of a New Series of 4-Heteroarylamino-1'-azaspiro[oxazole-5,3'-bicyclo[2.2.2]octanes asa7 Nicotinic Receptor Agonists. 1. Development of Pharmacophore and Early Structure-Activity Relationship. J Med Chem59:11171-11181 (2016) 
 
5-hydroxytryptamine receptor 3A
Name:5-hydroxytryptamine receptor 3A
Type:Protein
Mol. Mass.:55283.27
Organism:Homo sapiens (Human)
Description:P46098
Residue:478
BDBM50211215
NameBDBM50211215
Synonyms:CHEMBL3898922
TypeSmall organic molecule
Emp. Form.C14H18N4O
Mol. Mass.258.3189
SMILESC1N=C(Nc2ccccn2)O[C@]11CN2CCC1CC2