Reaction Details
TargetAcetylcholine receptor subunit alpha/beta/delta/epsilon
LigandBDBM50206243
Substrate/Competitorn/a
Meas. Tech.ChEMBL_1636037 (CHEMBL3878935)
EC50>100000±n/a nM
Citation Cook, JZusi, FCMcDonald, IMKing, DHill, MDIwuagwu, CMate, RAFang, HZhao, RWang, BCutrone, JMa, BGao, QKnox, RJMatchett, MGallagher, LFerrante, MPost-Munson, DMolski, TEaston, AMiller, RJones, KDigavalli, SHealy, FLentz, KBenitex, YClarke, WNatale, JSiuciak, JALodge, NZaczek, RDenton, RMorgan, DBristow, LJMacor, JEOlson, RE Design and Synthesis of a New Series of 4-Heteroarylamino-1'-azaspiro[oxazole-5,3'-bicyclo[2.2.2]octanes asa7 Nicotinic Receptor Agonists. 1. Development of Pharmacophore and Early Structure-Activity Relationship. J Med Chem59:11171-11181 (2016) 
 
Acetylcholine receptor subunit alpha/beta/delta/epsilon
Name:Acetylcholine receptor subunit alpha/beta/delta/epsilon
Synonyms:Nicotinic acetylcholine receptor alpha-1/beta-1/delta/epsilon
Type:n/a
Mol. Mass.:n/a
Description:ASSAY_ID of ChEMBL is 1636037
Components:This complex has 4 components.
Component 1
Name:Acetylcholine receptor subunit beta
Type:PROTEIN
Mol. Mass.:57017.04
Organism:Rattus norvegicus
Description:ChEMBL_117053
Residue:501
Component 2
Name:Acetylcholine receptor subunit alpha
Synonyms:ACHA_RAT Acra Chrna1
Type:Enzyme Catalytic Domain
Mol. Mass.:51863.95
Organism:RAT
Description:Cholinergic, Nicotinic Alpha1Beta1DeltaGamma 0 RAT::P25108
Residue:457
Component 3
Name:Acetylcholine receptor subunit delta
Synonyms:ACHD_RAT Acrd | Chrnd
Type:PROTEIN
Mol. Mass.:58877.21
Organism:Rattus norvegicus
Description:ChEMBL_117053
Residue:517
Component 4
Name:Acetylcholine receptor subunit epsilon
Synonyms:ACHE_RAT Achre | Chrne
Type:PROTEIN
Mol. Mass.:54930.09
Organism:Rattus norvegicus
Description:ChEMBL_1292388
Residue:494
BDBM50206243
NameBDBM50206243
Synonyms:CHEMBL3918431
TypeSmall organic molecule
Emp. Form.C18H20N4O
Mol. Mass.308.3776
SMILESC1N=C(Nc2cc3ccccc3cn2)O[C@]11CN2CCC1CC2