Reaction Details
TargetMacrophage colony-stimulating factor 1 receptor
LigandBDBM50211223
Substrate/Competitorn/a
Meas. Tech.ChEMBL_1636087 (CHEMBL3878985)
IC50 227±n/a nM
Citation Wang, QLiu, FWang, BZou, FQi, ZChen, CYu, KHu, CQi, SWang, WHu, ZLiu, JWang, WWang, LLiang, QZhang, SRen, TLiu, QLiu, J Discovery of 4-Methyl-N-(4-((4-methylpiperazin-1-yl)methyl)-3-(trifluoromethyl)phenyl)-3-((1-nicotinoylpiperidin-4-yl)oxy)benzamide (CHMFL-ABL/KIT-155) as a Novel Highly Potent Type II ABL/KIT Dual Kinase Inhibitor with a Distinct Hinge Binding. J Med Chem60:273-289 (2017) 
 
Macrophage colony-stimulating factor 1 receptor
Name:Macrophage colony-stimulating factor 1 receptor
Type:Protein
Mol. Mass.:107979.48
Organism:Homo sapiens (Human)
Description:P07333
Residue:972
BDBM50211223
NameBDBM50211223
Synonyms:CHEMBL3939150
TypeSmall organic molecule
Emp. Form.C33H38F3N5O3
Mol. Mass.609.6817
SMILESCN1CCN(Cc2ccc(cc2C(F)(F)F)C(=O)Nc2ccc(C)c(OC3CCN(CC3)C(=O)c3ccc(C)nc3)c2)CC1