Reaction Details
TargetQuinolone resistance protein NorA
LigandBDBM50211229
Substrate/Competitorn/a
Meas. Tech.ChEMBL_1636257 (CHEMBL3879155)
IC50 4930±n/a nM
Citation Buonerba, FLepri, SGoracci, LSchindler, BDSeo, SMKaatz, GWCruciani, G Improved Potency of Indole-Based NorA Efflux Pump Inhibitors: From Serendipity toward Rational Design and Development. J Med Chem60:517-523 (2017) 
 
Quinolone resistance protein NorA
Name:Quinolone resistance protein NorA
Type:PROTEIN
Mol. Mass.:42273.03
Organism:Staphylococcus aureus
Description:ChEMBL_961221
Residue:388
BDBM50211229
NameBDBM50211229
Synonyms:CHEMBL3955315
TypeSmall organic molecule
Emp. Form.C37H38N6O6
Mol. Mass.662.7342
SMILESCCOC(=O)c1c(C)n(Cc2ccccc2)c2ccc(OCC(O)CNCc3ccc(Oc4nnnn4-c4ccccc4)c(OC)c3)cc12