Reaction Details
TargetMonoacylglycerol lipase ABHD6
LigandBDBM50211233
Substrate/Competitorn/a
Meas. Tech.ChEBML_1636269
IC50 158±n/a nM
Citation Deng, HKooijman, Svan den Nieuwendijk, AMOgasawara, Dvan der Wel, Tvan Dalen, FBaggelaar, MPJanssen, FJvan den Berg, RJden Dulk, HCravatt, BFOverkleeft, HSRensen, PCvan der Stelt, M Triazole Ureas Act as Diacylglycerol Lipase Inhibitors and Prevent Fasting-Induced Refeeding. J Med Chem60:428-440 (2017) 
 
Monoacylglycerol lipase ABHD6
Name:Monoacylglycerol lipase ABHD6
Type:PROTEIN
Mol. Mass.:38341.83
Organism:Homo sapiens (Human)
Description:ChEMBL_105457
Residue:337
BDBM50211233
NameBDBM50211233
Synonyms:CHEMBL3941507
TypeSmall organic molecule
Emp. Form.C29H28F2N4O3
Mol. Mass.518.5544
SMILESCOc1cccc(CC2CCCCN2C(=O)n2ncc(n2)C(O)(c2ccc(F)cc2)c2ccc(F)cc2)c1