Reaction Details
TargetDiacylglycerol lipase-alpha
LigandBDBM50211275
Substrate/Competitorn/a
Meas. Tech.ChEBML_1636270
IC50 13±n/a nM
Citation Deng, HKooijman, Svan den Nieuwendijk, AMOgasawara, Dvan der Wel, Tvan Dalen, FBaggelaar, MPJanssen, FJvan den Berg, RJden Dulk, HCravatt, BFOverkleeft, HSRensen, PCvan der Stelt, M Triazole Ureas Act as Diacylglycerol Lipase Inhibitors and Prevent Fasting-Induced Refeeding. J Med Chem60:428-440 (2017) 
 
Diacylglycerol lipase-alpha
Name:Diacylglycerol lipase-alpha
Type:PROTEIN
Mol. Mass.:114947.74
Organism:Homo sapiens (Human)
Description:ChEMBL_1449471
Residue:1042
BDBM50211275
NameBDBM50211275
Synonyms:CHEMBL3931744
TypeSmall organic molecule
Emp. Form.C28H24F2N4O3
Mol. Mass.502.512
SMILESO[C@H]1CN([C@@H](Cc2ccccc2)C=C1)C(=O)n1ncc(n1)C(O)(c1ccc(F)cc1)c1ccc(F)cc1