Reaction Details
TargetDiacylglycerol lipase-alpha
LigandBDBM50211271
Substrate/Competitorn/a
Meas. Tech.ChEBML_1636270
IC50 0.794328±n/a nM
Citation Deng, HKooijman, Svan den Nieuwendijk, AMOgasawara, Dvan der Wel, Tvan Dalen, FBaggelaar, MPJanssen, FJvan den Berg, RJden Dulk, HCravatt, BFOverkleeft, HSRensen, PCvan der Stelt, M Triazole Ureas Act as Diacylglycerol Lipase Inhibitors and Prevent Fasting-Induced Refeeding. J Med Chem60:428-440 (2017) 
 
Diacylglycerol lipase-alpha
Name:Diacylglycerol lipase-alpha
Type:PROTEIN
Mol. Mass.:114947.74
Organism:Homo sapiens (Human)
Description:ChEMBL_1449471
Residue:1042
BDBM50211271
NameBDBM50211271
Synonyms:CHEMBL3913807
TypeSmall organic molecule
Emp. Form.C29H28F2N4O3
Mol. Mass.518.5544
SMILESCO[C@@H]1CC[C@H](Cc2ccccc2)N(C1)C(=O)n1ncc(n1)C(O)(c1ccc(F)cc1)c1ccc(F)cc1