Reaction Details
TargetDiacylglycerol lipase-alpha
LigandBDBM50211266
Substrate/Competitorn/a
Meas. Tech.ChEBML_1636271
IC50 7.9±n/a nM
Citation Deng, HKooijman, Svan den Nieuwendijk, AMOgasawara, Dvan der Wel, Tvan Dalen, FBaggelaar, MPJanssen, FJvan den Berg, RJden Dulk, HCravatt, BFOverkleeft, HSRensen, PCvan der Stelt, M Triazole Ureas Act as Diacylglycerol Lipase Inhibitors and Prevent Fasting-Induced Refeeding. J Med Chem60:428-440 (2017) 
 
Diacylglycerol lipase-alpha
Name:Diacylglycerol lipase-alpha
Type:PROTEIN
Mol. Mass.:115371.22
Organism:Mus musculus
Description:ChEMBL_101098
Residue:1044
BDBM50211266
NameBDBM50211266
Synonyms:CHEMBL3906477
TypeSmall organic molecule
Emp. Form.C27H26N4O
Mol. Mass.422.5215
SMILESO=C(N1CCCC[C@@H]1Cc1ccccc1)n1cc(nn1)-c1ccc(cc1)-c1ccccc1