Reaction Details
TargetMethionine aminopeptidase 2
LigandBDBM76305
Substrate/Competitorn/a
Meas. Tech.ChEMBL_1636404 (CHEMBL3879302)
IC50 55±n/a nM
Citation Helgren, TRChen, CWangtrakuldee, PEdwards, TEStaker, BLAbendroth, JSankaran, BHousley, NAMyler, PJAudia, JPHorn, JRHagen, TJ Rickettsia prowazekii methionine aminopeptidase as a promising target for the development of antibacterial agents. Bioorg Med Chem25:813-824 (2017) 
 
Methionine aminopeptidase 2
Name:Methionine aminopeptidase 2
Type:Enzyme
Mol. Mass.:52884.45
Organism:Homo sapiens (Human)
Description:P50579
Residue:478
BDBM76305
NameBDBM76305
Synonyms:5-chloranylquinolin-8-ol 5-chloroquinolin-8-ol SMR000274338 | cid_2817
TypeSmall organic molecule
Emp. Form.C9H6ClNO
Mol. Mass.179.603
SMILESOc1ccc(Cl)c2cccnc12