Reaction Details
TargetDihydroorotate dehydrogenase (quinone), mitochondrial
LigandBDBM50211938
Substrate/Competitorn/a
Meas. Tech.ChEMBL_1636657 (CHEMBL3879555)
Ki 217000±n/a nM
Citation Inaoka, DKIida, MHashimoto, STabuchi, TKuranaga, TBalogun, EOHonma, TTanaka, AHarada, SNara, TKita, KInoue, M Design and synthesis of potent substrate-based inhibitors of the Trypanosoma cruzi dihydroorotate dehydrogenase. Bioorg Med Chem25:1465-1470 (2017) 
 
Dihydroorotate dehydrogenase (quinone), mitochondrial
Name:Dihydroorotate dehydrogenase (quinone), mitochondrial
Type:Enzyme
Mol. Mass.:42881.33
Organism:Homo sapiens (Human)
Description:Q02127
Residue:395
BDBM50211938
NameBDBM50211938
Synonyms:CHEMBL3955618
TypeSmall organic molecule
Emp. Form.C19H21N3O5
Mol. Mass.371.3871
SMILESNCCO.OC(=O)c1[nH]c(=O)[nH]c(=O)c1CCc1cccc2ccccc12