Reaction Details
TargetDihydroorotate dehydrogenase (quinone), mitochondrial
LigandBDBM50211942
Substrate/Competitorn/a
Meas. Tech.ChEMBL_1636657 (CHEMBL3879555)
Ki 19900±n/a nM
Citation Inaoka, DKIida, MHashimoto, STabuchi, TKuranaga, TBalogun, EOHonma, TTanaka, AHarada, SNara, TKita, KInoue, M Design and synthesis of potent substrate-based inhibitors of the Trypanosoma cruzi dihydroorotate dehydrogenase. Bioorg Med Chem25:1465-1470 (2017) 
 
Dihydroorotate dehydrogenase (quinone), mitochondrial
Name:Dihydroorotate dehydrogenase (quinone), mitochondrial
Type:Enzyme
Mol. Mass.:42881.33
Organism:Homo sapiens (Human)
Description:Q02127
Residue:395
BDBM50211942
NameBDBM50211942
Synonyms:CHEMBL3935254
TypeSmall organic molecule
Emp. Form.C20H23N3O6
Mol. Mass.401.4131
SMILESNCCO.COc1cc2ccccc2cc1CCc1c([nH]c(=O)[nH]c1=O)C(O)=O