Reaction Details
TargetDihydroorotate dehydrogenase (quinone), mitochondrial
LigandBDBM50212058
Substrate/Competitorn/a
Meas. Tech.ChEMBL_1636657 (CHEMBL3879555)
Ki 20200±n/a nM
Citation Inaoka, DKIida, MHashimoto, STabuchi, TKuranaga, TBalogun, EOHonma, TTanaka, AHarada, SNara, TKita, KInoue, M Design and synthesis of potent substrate-based inhibitors of the Trypanosoma cruzi dihydroorotate dehydrogenase. Bioorg Med Chem25:1465-1470 (2017) 
 
Dihydroorotate dehydrogenase (quinone), mitochondrial
Name:Dihydroorotate dehydrogenase (quinone), mitochondrial
Type:Enzyme
Mol. Mass.:42881.33
Organism:Homo sapiens (Human)
Description:Q02127
Residue:395
BDBM50212058
NameBDBM50212058
Synonyms:CHEMBL3928909
TypeSmall organic molecule
Emp. Form.C22H26N4O6
Mol. Mass.442.465
SMILESNCCO.CN(C)C(=O)c1cccc2cc(CCc3c([nH]c(=O)[nH]c3=O)C(O)=O)ccc12