Reaction Details
TargetAcyl-protein thioesterase 2
LigandBDBM50212218
Substrate/Competitorn/a
Meas. Tech.ChEMBL_1636766 (CHEMBL3879664)
Ki>10000±n/a nM
Citation Won, SJEschweiler, JDMajmudar, JDChong, FSHwang, SYRuotolo, BTMartin, BR Affinity-Based Selectivity Profiling of an In-Class Selective Competitive Inhibitor of Acyl Protein Thioesterase 2. ACS Med Chem Lett8:215-220 (2017) 
 
Acyl-protein thioesterase 2
Name:Acyl-protein thioesterase 2
Type:Protein
Mol. Mass.:24740.23
Organism:Homo sapiens (Human)
Description:O95372
Residue:231
BDBM50212218
NameBDBM50212218
Synonyms:CHEMBL3974081
TypeSmall organic molecule
Emp. Form.C18H32N6O5S
Mol. Mass.444.549
SMILES[H][C@]12CS[C@@H](CCCCC(=O)NCCOCCOCCOCCN=[N+]=[N-])[C@@]1([H])NC(=O)N2