Reaction Details
TargetMitogen-activated protein kinase kinase kinase 5
LigandBDBM50212262
Substrate/Competitorn/a
Meas. Tech.ChEMBL_1636848 (CHEMBL3879746)
IC50 16±n/a nM
Citation Lanier, MPickens, JBigi, SVBradshaw-Pierce, ELChambers, ACheruvallath, ZSCole, DDougan, DRErmolieff, JGibson, THalkowycz, PHirokawa, AIvetac, AMiura, JNunez, ESabat, MTyhonas, JWang, HWang, XSwann, S Structure-Based Design of ASK1 Inhibitors as Potential Agents for Heart Failure. ACS Med Chem Lett8:316-320 (2017) 
 
Mitogen-activated protein kinase kinase kinase 5
Name:Mitogen-activated protein kinase kinase kinase 5
Type:Protein
Mol. Mass.:154514.93
Organism:Homo sapiens (Human)
Description:Q99683
Residue:1374
BDBM50212262
NameBDBM50212262
Synonyms:CHEMBL3937245
TypeSmall organic molecule
Emp. Form.C21H23N5O2
Mol. Mass.377.4396
SMILESCC(C)Oc1ccc2CN(C(=O)c2c1)c1cccc(n1)-c1nncn1C(C)C